Reaction Details
TargetAP2-associated protein kinase 1
LigandBDBM311370
Substrate/Competitorn/a
Meas. Tech.AAK1 Kinase Assay
IC50 0.410±n/a nM
Citation Luo, GDzierba, CDMacor, JE Biaryl kinase inhibitors US Patent US10155760 Publication Date 12/18/2018
 
AP2-associated protein kinase 1
Name:AP2-associated protein kinase 1
Type:PROTEIN
Mol. Mass.:103884.23
Organism:Homo sapiens (Human)
Description:ChEMBL_774569
Residue:961
BDBM311370
NameBDBM311370
Synonyms:(S)-1-((6-(7-fluoroquinolin-4-yl)-4-methylpyridin-3-yl)oxy)-2,4-dimethylpentan-2-amine US10155760, Example 227 US10544120, Example 227 US10981910, Example 227 | US9902722, Example 227
TypeSmall organic molecule
Emp. Form.C22H26FN3O
Mol. Mass.367.4597
SMILESCC(C)C[C@](C)(N)COc1cnc(cc1C)-c1ccnc2cc(F)ccc12