Reaction Details
TargetN-formyl peptide receptor 2
LigandBDBM632106
Substrate/Competitorn/a
Meas. Tech.FPR2 and FPR1 Cyclic Adenosine Monophosphate (cAMP) Assays
EC50 0.400±n/a nM
Citation Shirude, PSRachamreddy, CRChattopadhyay, AKSeshadri, BBaligar, VMadduri, SRKick, EKWurtz, NR OXOPYRROLIDINE FPR2 AGONISTS US Patent US20230348426 Publication Date 11/2/2023
 
N-formyl peptide receptor 2
Name:N-formyl peptide receptor 2
Type:G Protein-Coupled Receptor (GPCR)
Mol. Mass.:38968.35
Organism:Homo sapiens (Human)
Description:P25090
Residue:351
BDBM632106
NameBDBM632106
Synonyms:US20230348426, Example 376
TypeSmall organic molecule
Emp. Form.C27H24F5N3O5
Mol. Mass.565.4886
SMILESCOc1ccc([C@@H]2CN(C(=O)[C@H]2NC(=O)c2ccc(OC(F)F)cc2)c2c(C)ccn(CC(F)F)c2=O)c(F)c1