Reaction Details
TargetN-formyl peptide receptor 2
LigandBDBM632258
Substrate/Competitorn/a
Meas. Tech.FPR2 and FPR1 Cyclic Adenosine Monophosphate (cAMP) Assays
EC50 0.200±n/a nM
Citation Shirude, PSRachamreddy, CRChattopadhyay, AKSeshadri, BBaligar, VMadduri, SRKick, EKWurtz, NR OXOPYRROLIDINE FPR2 AGONISTS US Patent US20230348426 Publication Date 11/2/2023
 
N-formyl peptide receptor 2
Name:N-formyl peptide receptor 2
Type:G Protein-Coupled Receptor (GPCR)
Mol. Mass.:38968.35
Organism:Homo sapiens (Human)
Description:P25090
Residue:351
BDBM632258
NameBDBM632258
Synonyms:US20230348426, Example 528
TypeSmall organic molecule
Emp. Form.C30H30F4N4O4
Mol. Mass.586.5772
SMILESCOc1cc(F)c([C@@H]2[C@H](C)N(C(=O)[C@H]2NC(=O)c2ccc(OC(F)F)cc2)c2cccc(n2)C2CCNCC2)c(F)c1