Reaction Details
TargetHistone acetyltransferase KAT2B [719-832]
LigandBDBM311444
Substrate/Competitorn/a
Meas. Tech.PCAF AlphaLisa Binding Assay
IC50 69.0±n/a nM
Citation Albrecht, BKCote, ACrawford, TDuplessis, MGood, ACLeBlanc, YMagnuson, SNasveschuk, CGPastor, RRomero, AFTaylor, AM Therapeutic compounds and uses thereof US Patent US10155764 Publication Date 12/18/2018
 
Histone acetyltransferase KAT2B [719-832]
Name:Histone acetyltransferase KAT2B [719-832]
Type:Enzyme Catalytic Domain
Mol. Mass.:13623.13
Organism:Homo sapiens (Human)
Description:Q92831[719-832]
Residue:114
BDBM311444
NameBDBM311444
Synonyms:CHEM-US-00141 US10155764, Example 32A | US10155764, Example 32B
TypeSmall organic molecule
Emp. Form.C21H25ClN6O
Mol. Mass.412.916
SMILESCN(C)C1CN(CCC1Nc1nn(C)c(=O)c2cccnc12)c1ccc(Cl)cc1