Reaction Details
TargetHistone acetyltransferase KAT2B [719-832]
LigandBDBM311472
Substrate/Competitorn/a
Meas. Tech.PCAF AlphaLisa Binding Assay
IC50 110±n/a nM
Citation Albrecht, BKCote, ACrawford, TDuplessis, MGood, ACLeBlanc, YMagnuson, SNasveschuk, CGPastor, RRomero, AFTaylor, AM Therapeutic compounds and uses thereof US Patent US10155764 Publication Date 12/18/2018
 
Histone acetyltransferase KAT2B [719-832]
Name:Histone acetyltransferase KAT2B [719-832]
Type:Enzyme Catalytic Domain
Mol. Mass.:13623.13
Organism:Homo sapiens (Human)
Description:Q92831[719-832]
Residue:114
BDBM311472
NameBDBM311472
Synonyms:CHEM-US-00174 US10155764, Example 54A
TypeSmall organic molecule
Emp. Form.C17H24N4O
Mol. Mass.300.3987
SMILESCN(C)[C@H]1CCCC[C@H]1Nc1nn(C)c(=O)c2ccccc12