Reaction Details
TargetHistone acetyltransferase KAT2B [719-832]
LigandBDBM311509
Substrate/Competitorn/a
Meas. Tech.PCAF AlphaLisa Binding Assay
IC50 56.0±n/a nM
Citation Albrecht, BKCote, ACrawford, TDuplessis, MGood, ACLeBlanc, YMagnuson, SNasveschuk, CGPastor, RRomero, AFTaylor, AM Therapeutic compounds and uses thereof US Patent US10155764 Publication Date 12/18/2018
 
Histone acetyltransferase KAT2B [719-832]
Name:Histone acetyltransferase KAT2B [719-832]
Type:Enzyme Catalytic Domain
Mol. Mass.:13623.13
Organism:Homo sapiens (Human)
Description:Q92831[719-832]
Residue:114
BDBM311509
NameBDBM311509
Synonyms:CHEM-US-00229 | US10155764, Example 84
TypeSmall organic molecule
Emp. Form.C28H32N6O2
Mol. Mass.484.5927
SMILESC[C@H](Nc1nn(C)c(=O)c2cccnc12)[C@@H](N(C)C)c1ccc(cc1)C(=O)N(C)Cc1ccccc1