Reaction Details
TargetHistone acetyltransferase KAT2B [719-832]
LigandBDBM311511
Substrate/Competitorn/a
Meas. Tech.PCAF AlphaLisa Binding Assay
IC50 30.0±n/a nM
Citation Albrecht, BKCote, ACrawford, TDuplessis, MGood, ACLeBlanc, YMagnuson, SNasveschuk, CGPastor, RRomero, AFTaylor, AM Therapeutic compounds and uses thereof US Patent US10155764 Publication Date 12/18/2018
 
Histone acetyltransferase KAT2B [719-832]
Name:Histone acetyltransferase KAT2B [719-832]
Type:Enzyme Catalytic Domain
Mol. Mass.:13623.13
Organism:Homo sapiens (Human)
Description:Q92831[719-832]
Residue:114
BDBM311511
NameBDBM311511
Synonyms:US10155764, Example 86
TypeSmall organic molecule
Emp. Form.C23H29N5O3
Mol. Mass.423.5081
SMILESCC(C)OC(=O)c1ccc(cc1)[C@@H]([C@H](C)Nc1nn(C)c(=O)c2cccnc12)N(C)C