Reaction Details
TargetHistone acetyltransferase KAT2B [719-832]
LigandBDBM311513
Substrate/Competitorn/a
Meas. Tech.PCAF AlphaLisa Binding Assay
IC50 80.0±n/a nM
Citation Albrecht, BKCote, ACrawford, TDuplessis, MGood, ACLeBlanc, YMagnuson, SNasveschuk, CGPastor, RRomero, AFTaylor, AM Therapeutic compounds and uses thereof US Patent US10155764 Publication Date 12/18/2018
 
Histone acetyltransferase KAT2B [719-832]
Name:Histone acetyltransferase KAT2B [719-832]
Type:Enzyme Catalytic Domain
Mol. Mass.:13623.13
Organism:Homo sapiens (Human)
Description:Q92831[719-832]
Residue:114
BDBM311513
NameBDBM311513
Synonyms:US10155764, Example 88
TypeSmall organic molecule
Emp. Form.C19H23N5O2
Mol. Mass.353.4182
SMILESC[C@H](Nc1nn(C)c(=O)c2ccccc12)[C@@H](N(C)C)c1ccc(=O)[nH]c1