Reaction Details
TargetInterleukin-1 receptor-associated kinase 4
LigandBDBM311536
Substrate/Competitorn/a
Meas. Tech.IRAK4 Kinase Assay
IC50 2.00±n/a nM
Citation Lim, JAltman, MDChilders, MLGibeau, CRHo, GDTsui, H Carboxamide inhibitors of IRAK4 activity US Patent US10155765 Publication Date 12/18/2018
 
Interleukin-1 receptor-associated kinase 4
Name:Interleukin-1 receptor-associated kinase 4
Type:Protein
Mol. Mass.:51519.08
Organism:Homo sapiens (Human)
Description:Q9NWZ3
Residue:460
BDBM311536
NameBDBM311536
Synonyms:5-{[(1R,2S)-2- aminocyclohexyl]amino}- N-{3-carbamoyl-1-[(1- methylpiperidin-3- yl)methyl]-1H-pyrazol-4- yl}pyrazolo[1,5- a]pyrimidine-3- carboxamide trifluoroacetate | US10155765, Example 25
TypeSmall organic molecule
Emp. Form.C24H34N10O2
Mol. Mass.494.5926
SMILESCN1CCCC(Cn2cc(NC(=O)c3cnn4ccc(N[C@@H]5CCCC[C@@H]5N)nc34)c(n2)C(N)=O)C1