Reaction Details
TargetBromodomain-containing protein 4 [75-147]
LigandBDBM640356
Substrate/Competitorn/a
Meas. Tech.TR-FRET BRD4 Binding Assay
Ki<100.0±n/a nM
Citation Thatcher, GRXiong, RZhao, JLi, Y Pyridinone-based epigenetic modifiers and uses thereof US Patent US11840533 Publication Date 12/12/2023
 
Bromodomain-containing protein 4 [75-147]
Name:Bromodomain-containing protein 4 [75-147]
Type:n/a
Mol. Mass.:8856.55
Organism:Homo sapiens (Human)
Description:BD1 (75-147 aa) of O60885
Residue:73
BDBM640356
NameBDBM640356
Synonyms:N-(1-(4-fluorobenzyl)-6-(7- hydroxy-1-methyl-1H- pyrrolo[2,3-c]pyridin-3-yl)- 1H-indol-4- yl)methanesulfonamide | US11840533, Compound 23
TypeSmall organic molecule
Emp. Form.C24H21FN4O3S
Mol. Mass.464.512
SMILESCn1cc(-c2cc(NS(C)(=O)=O)c3ccn(Cc4ccc(F)cc4)c3c2)c2ccnc(O)c12