Reaction Details
TargetBromodomain-containing protein 4 [368-440]
LigandBDBM640358
Substrate/Competitorn/a
Ki<100.0±n/a nM
Citation Thatcher, GRXiong, RZhao, JLi, Y Pyridinone-based epigenetic modifiers and uses thereof US Patent US11840533 Publication Date 12/12/2023
 
Bromodomain-containing protein 4 [368-440]
Name:Bromodomain-containing protein 4 [368-440]
Type:Protein
Mol. Mass.:8564.63
Organism:Homo sapiens (Human)
Description:BD2 (368-440 aa) of O60885
Residue:73
BDBM640358
NameBDBM640358
Synonyms:N-(1-(4-fluorobenzyl)-6-(7- hydroxy-1-methyl-1H- pyrrolo[2,3-c]pyridin-3-yl)- 1H-indazol-4- yl)ethanesulfonamide | US11840533, Compound 31
TypeSmall organic molecule
Emp. Form.C24H22FN5O3S
Mol. Mass.479.527
SMILESCCS(=O)(=O)Nc1cc(cc2n(Cc3ccc(F)cc3)ncc12)-c1cn(C)c2c(O)nccc12