Reaction Details
TargetBromodomain-containing protein 4 [75-147]
LigandBDBM50539801
Substrate/Competitorn/a
Meas. Tech.TR-FRET BRD4 Binding Assay
Ki<10.00±n/a nM
Citation Thatcher, GRXiong, RZhao, JLi, Y Pyridinone-based epigenetic modifiers and uses thereof US Patent US11840533 Publication Date 12/12/2023
 
Bromodomain-containing protein 4 [75-147]
Name:Bromodomain-containing protein 4 [75-147]
Type:n/a
Mol. Mass.:8856.55
Organism:Homo sapiens (Human)
Description:BD1 (75-147 aa) of O60885
Residue:73
BDBM50539801
NameBDBM50539801
Synonyms:CHEMBL4648912 | US11840533, Compound 70
TypeSmall organic molecule
Emp. Form.C30H28N6O3S
Mol. Mass.552.647
SMILESCCS(=O)(=O)Nc1cc(cc2n(ccc12)C(C)(c1ccccn1)c1ccccn1)-c1cn(C)c2c1cc[nH]c2=O