Reaction Details
TargetBromodomain-containing protein 4 [368-440]
LigandBDBM50539804
Substrate/Competitorn/a
Ki<10.00±n/a nM
Citation Thatcher, GRXiong, RZhao, JLi, Y Pyridinone-based epigenetic modifiers and uses thereof US Patent US11840533 Publication Date 12/12/2023
 
Bromodomain-containing protein 4 [368-440]
Name:Bromodomain-containing protein 4 [368-440]
Type:Protein
Mol. Mass.:8564.63
Organism:Homo sapiens (Human)
Description:BD2 (368-440 aa) of O60885
Residue:73
BDBM50539804
NameBDBM50539804
Synonyms:CHEMBL4640025 | US11840533, Compound 71
TypeSmall organic molecule
Emp. Form.C30H26N6O2
Mol. Mass.502.5664
SMILESCC(=O)Nc1cc(cc2n(ccc12)C(C)(c1ccccn1)c1ccccn1)-c1cn(C)c2c1cc[nH]c2=O