Reaction Details
TargetBromodomain-containing protein 4 [75-147]
LigandBDBM50539805
Substrate/Competitorn/a
Meas. Tech.TR-FRET BRD4 Binding Assay
Ki<10.00±n/a nM
Citation Thatcher, GRXiong, RZhao, JLi, Y Pyridinone-based epigenetic modifiers and uses thereof US Patent US11840533 Publication Date 12/12/2023
 
Bromodomain-containing protein 4 [75-147]
Name:Bromodomain-containing protein 4 [75-147]
Type:n/a
Mol. Mass.:8856.55
Organism:Homo sapiens (Human)
Description:BD1 (75-147 aa) of O60885
Residue:73
BDBM50539805
NameBDBM50539805
Synonyms:CHEMBL4644032 | US11840533, Compound 72
TypeSmall organic molecule
Emp. Form.C31H29N5O2
Mol. Mass.503.5943
SMILESCn1cc(-c2cc(c3ccn(c3c2)C(C)(c2ccccn2)c2ccccn2)C(C)(C)O)c2cc[nH]c(=O)c12