Reaction Details
TargetTranscription factor SOX-18
LigandBDBM85507
Substrate/Competitorn/a
Meas. Tech.Inhibition of Sox18-DNA Binding Assay
IC50 375000±84000 nM
Citation FRANCOIS, MZUEGG, JOVERMAN, JMAMIDYALA, SKSALIM, AAFONTAINE, FRCOOPER, MACAPON, RJROBERTSON, AA COMPOUNDS AND USE THEREOF IN METHODS OF TREATMENT US Patent US20240002326 Publication Date 1/4/2024
 
Transcription factor SOX-18
Name:Transcription factor SOX-18
Synonyms:n/a
Type:Protein
Mol. Mass.:40895.30
Organism:Human
Description:P35713
Residue:384
BDBM85507
NameBDBM85507
TypeSmall organic molecule
Emp. Form.C13H9F3N2O2
Mol. Mass.282.218
SMILESOC(=O)c1cccnc1Nc1cccc(c1)C(F)(F)F