Reaction Details
TargetNuclear receptor subfamily 1 group D member 2
LigandBDBM643178
Substrate/Competitorn/a
Meas. Tech.FRET Assay for REV-ERB Ligands
IC50<250±n/a nM
Citation Walker, JKBurris, TPSitaula, SChatterjee, AD''Cunha, NCJacobsen, EJBlinn, JR REV-ERB AGONISTS US Patent US20240002380 Publication Date 1/4/2024
 
Nuclear receptor subfamily 1 group D member 2
Name:Nuclear receptor subfamily 1 group D member 2
Type:PROTEIN
Mol. Mass.:64639.08
Organism:Homo sapiens (Human)
Description:ChEMBL_1502200
Residue:579
BDBM643178
NameBDBM643178
Synonyms:US20240002380, Example 4
TypeSmall organic molecule
Emp. Form.C20H17N3O
Mol. Mass.315.3685
SMILESCc1cccc(c1)-c1ccccc1Oc1ccc2ncn(C)c2n1