Reaction Details
TargetNuclear receptor subfamily 1 group D member 2
LigandBDBM643181
Substrate/Competitorn/a
Meas. Tech.FRET Assay for REV-ERB Ligands
IC50<250±n/a nM
Citation Walker, JKBurris, TPSitaula, SChatterjee, AD''Cunha, NCJacobsen, EJBlinn, JR REV-ERB AGONISTS US Patent US20240002380 Publication Date 1/4/2024
 
Nuclear receptor subfamily 1 group D member 2
Name:Nuclear receptor subfamily 1 group D member 2
Type:PROTEIN
Mol. Mass.:64639.08
Organism:Homo sapiens (Human)
Description:ChEMBL_1502200
Residue:579
BDBM643181
NameBDBM643181
Synonyms:US20240002380, Example 10
TypeSmall organic molecule
Emp. Form.C17H13N5O
Mol. Mass.303.318
SMILESCn1ncc2cnc(Oc3ccccc3-c3cccnc3)nc12