Reaction Details
TargetNuclear receptor subfamily 1 group D member 2
LigandBDBM643188
Substrate/Competitorn/a
Meas. Tech.FRET Assay for REV-ERB Ligands
IC50>10000±n/a nM
Citation Walker, JKBurris, TPSitaula, SChatterjee, AD''Cunha, NCJacobsen, EJBlinn, JR REV-ERB AGONISTS US Patent US20240002380 Publication Date 1/4/2024
 
Nuclear receptor subfamily 1 group D member 2
Name:Nuclear receptor subfamily 1 group D member 2
Type:PROTEIN
Mol. Mass.:64639.08
Organism:Homo sapiens (Human)
Description:ChEMBL_1502200
Residue:579
BDBM643188
NameBDBM643188
Synonyms:US20240002380, Example 34
TypeSmall organic molecule
Emp. Form.C22H14F3NO
Mol. Mass.365.3479
SMILESFC(F)(F)c1cc(Oc2ccccc2-c2ccccc2)nc2ccccc12