Reaction Details
TargetNuclear receptor subfamily 1 group D member 2
LigandBDBM643197
Substrate/Competitorn/a
Meas. Tech.FRET Assay for REV-ERB Ligands
IC50>10000±n/a nM
Citation Walker, JKBurris, TPSitaula, SChatterjee, AD''Cunha, NCJacobsen, EJBlinn, JR REV-ERB AGONISTS US Patent US20240002380 Publication Date 1/4/2024
 
Nuclear receptor subfamily 1 group D member 2
Name:Nuclear receptor subfamily 1 group D member 2
Type:PROTEIN
Mol. Mass.:64639.08
Organism:Homo sapiens (Human)
Description:ChEMBL_1502200
Residue:579
BDBM643197
NameBDBM643197
Synonyms:US20240002380, Example 56
TypeSmall organic molecule
Emp. Form.C18H12N2O
Mol. Mass.272.3007
SMILESO(c1ccc2cnccc2n1)c1cccc2ccccc12