Reaction Details
TargetSigma intracellular receptor 2
LigandBDBM50353844
Substrate/Competitorn/a
Meas. Tech.Receptor Assay
Ki 0.390±0.06 nM
Citation McCurdy, CRMesangeau, CChin, FTJames, MLShen, BGambhir, S Highly selective sigma receptor radioligands US Patent US9604926 Publication Date 3/28/2017
 
Sigma intracellular receptor 2
Name:Sigma intracellular receptor 2
Type:n/a
Mol. Mass.:20818.69
Organism:Mus musculus (Mouse)
Description:Q8VD00
Residue:176
BDBM50353844
NameBDBM50353844
Synonyms:CHEMBL270341 US9724435, Compound CM-145
TypeSmall organic molecule
Emp. Form.C21H31N3OS
Mol. Mass.373.555
SMILESO=c1sc2ccccc2n1CCCCN1CCN(CC1)C1CCCCC1