Reaction Details
TargetSigma non-opioid intracellular receptor 1
LigandBDBM312166
Substrate/Competitorn/a
Meas. Tech.Receptor Assay
Ki 7.59±0.08 nM
Citation McCurdy, CRMesangeau, CChin, FTJames, MLShen, BGambhir, S Highly selective sigma receptor radioligands US Patent US9604926 Publication Date 3/28/2017
 
Sigma non-opioid intracellular receptor 1
Name:Sigma non-opioid intracellular receptor 1
Type:Enzyme Catalytic Domain
Mol. Mass.:25246.51
Organism:Mus musculus (Mouse)
Description:O55242
Residue:223
BDBM312166
NameBDBM312166
Synonyms:US9604926, Compound CM-170 | US9724435, Compound CM-170
TypeSmall organic molecule
Emp. Form.C21H24FN3O2
Mol. Mass.369.4326
SMILESFc1ccc(cc1)N1CCN(CCCCn2c3ccccc3oc2=O)CC1