Reaction Details
TargetSigma intracellular receptor 2
LigandBDBM312202
Substrate/Competitorn/a
Meas. Tech.Receptor Assay
Ki 0.460±0.03 nM
Citation McCurdy, CRMesangeau, CChin, FTJames, MLShen, BGambhir, S Highly selective sigma receptor radioligands US Patent US9604926 Publication Date 3/28/2017
 
Sigma intracellular receptor 2
Name:Sigma intracellular receptor 2
Type:n/a
Mol. Mass.:20818.69
Organism:Mus musculus (Mouse)
Description:Q8VD00
Residue:176
BDBM312202
NameBDBM312202
Synonyms:US9604926, Compound CM-397 | US9724435, Compound CM-397
TypeSmall organic molecule
Emp. Form.C22H27FN4O
Mol. Mass.382.4744
SMILESCn1c2ccccc2n(CCCCN2CCN(CC2)c2ccc(F)cc2)c1=O