Reaction Details
TargetGlutamate receptor ionotropic, NMDA 1
LigandBDBM50006607
Substrate/Competitorn/a
Meas. Tech.Receptor Assay
Ki>10000±0.0 nM
Citation McCurdy, CRMesangeau, CChin, FTJames, MLShen, BGambhir, S Highly selective sigma receptor radioligands US Patent US9604926 Publication Date 3/28/2017
 
Glutamate receptor ionotropic, NMDA 1
Name:Glutamate receptor ionotropic, NMDA 1
Type:Enzyme Catalytic Domain
Mol. Mass.:105397.81
Organism:Homo sapiens (Human)
Description:Q05586
Residue:938
BDBM50006607
NameBDBM50006607
Synonyms:CHEMBL3235465 US9724435, SN-79
TypeSmall organic molecule
Emp. Form.C23H26FN3O3
Mol. Mass.411.4692
SMILESCC(=O)c1ccc2n(CCCCN3CCN(CC3)c3ccc(F)cc3)c(=O)oc2c1