Reaction Details
TargetAmine oxidase [flavin-containing] A
LigandBDBM179672
Substrate/Competitorn/a
Meas. Tech.Monoamine Oxidase Assays
pH7.5±n/a
Ki>1000±n/a nM
Commentsextracted
Citation Fyfe, MCOrtega Muñoz, ACastro-Palomino Laria, JMartinell Pedemonte, MEstiarte-Martinez, MValls Vidal, N Cyclopropylamine derivatives useful as LSD1 inhibitors US Patent US9676701 Publication Date 6/13/2017
 
Amine oxidase [flavin-containing] A
Name:Amine oxidase [flavin-containing] A
Type:Protein
Mol. Mass.:59689.53
Organism:Homo sapiens (Human)
Description:P21397
Residue:527
BDBM179672
NameBDBM179672
Synonyms:US9676701, 31 (trans)-2-(6-(5-chlorothiophen-2-yl)pyridin-3-yl)cyclopropanamine hydrochloride
TypeSmall organic molecule
Emp. Form.C12H11ClN2S
Mol. Mass.250.747
SMILESN[C@H]1C[C@@H]1c1ccc(nc1)-c1ccc(Cl)s1