Reaction Details
TargetLysine-specific histone demethylase 1A
LigandBDBM179728
Substrate/Competitorn/a
Meas. Tech.LSD1 Assay
pH7.4±n/a
Temperature298.15±n/a K
Ki 550±n/a nM
Commentsextracted
Citation Fyfe, MCOrtega Muñoz, ACastro-Palomino Laria, JMartinell Pedemonte, MEstiarte-Martinez, MValls Vidal, N Cyclopropylamine derivatives useful as LSD1 inhibitors US Patent US9676701 Publication Date 6/13/2017
 
Lysine-specific histone demethylase 1A
Name:Lysine-specific histone demethylase 1A
Type:Enzyme
Mol. Mass.:92901.01
Organism:Homo sapiens (Human)
Description:O60341
Residue:852
BDBM179728
NameBDBM179728
Synonyms:US9676701, 47 3-(5-((trans)-2-aminocyclopropyl)pyridin-2-yl)-4-chlorophenol hydrochloride
TypeSmall organic molecule
Emp. Form.C14H13ClN2O
Mol. Mass.260.719
SMILESN[C@H]1C[C@@H]1c1ccc(nc1)-c1cc(O)ccc1Cl