Reaction Details
TargetAmine oxidase [flavin-containing] B
LigandBDBM179729
Substrate/Competitorn/a
Meas. Tech.Monoamine Oxidase Assays
pH7.5±n/a
Ki>1000±n/a nM
Commentsextracted
Citation Fyfe, MCOrtega Muñoz, ACastro-Palomino Laria, JMartinell Pedemonte, MEstiarte-Martinez, MValls Vidal, N Cyclopropylamine derivatives useful as LSD1 inhibitors US Patent US9676701 Publication Date 6/13/2017
 
Amine oxidase [flavin-containing] B
Name:Amine oxidase [flavin-containing] B
Type:Protein
Mol. Mass.:58768.76
Organism:Homo sapiens (Human)
Description:P27338
Residue:520
BDBM179729
NameBDBM179729
Synonyms:US9676701, 48 3-(5-((trans)-2-amninocyclopropyl)pyridin-2-yl)-5-(trifluoromethyl)phenol hydrochloride
TypeSmall organic molecule
Emp. Form.C15H13F3N2O
Mol. Mass.294.2717
SMILESN[C@H]1C[C@@H]1c1ccc(nc1)-c1cc(O)cc(c1)C(F)(F)F