Reaction Details
TargetAmine oxidase [flavin-containing] A
LigandBDBM179840
Substrate/Competitorn/a
Meas. Tech.Monoamine Oxidase Assays
pH7.5±n/a
Ki>1000±n/a nM
Commentsextracted
Citation Fyfe, MCOrtega Muñoz, ACastro-Palomino Laria, JMartinell Pedemonte, MEstiarte-Martinez, MValls Vidal, N Cyclopropylamine derivatives useful as LSD1 inhibitors US Patent US9676701 Publication Date 6/13/2017
 
Amine oxidase [flavin-containing] A
Name:Amine oxidase [flavin-containing] A
Type:Protein
Mol. Mass.:59689.53
Organism:Homo sapiens (Human)
Description:P21397
Residue:527
BDBM179840
NameBDBM179840
Synonyms:US9676701, 75 N-(4′-((trans)-2-aminocyclopropyl)-6-methoxybiphenyl-3-yl)methanesulfonamide hydrochloride
TypeSmall organic molecule
Emp. Form.C17H20N2O3S
Mol. Mass.332.417
SMILESCOc1ccc(NS(C)(=O)=O)cc1-c1ccc(cc1)[C@H]1C[C@@H]1N