Reaction Details
TargetAmine oxidase [flavin-containing] B
LigandBDBM179862
Substrate/Competitorn/a
Meas. Tech.Monoamine Oxidase Assays
pH7.5±n/a
Ki>1000±n/a nM
Commentsextracted
Citation Fyfe, MCOrtega Muñoz, ACastro-Palomino Laria, JMartinell Pedemonte, MEstiarte-Martinez, MValls Vidal, N Cyclopropylamine derivatives useful as LSD1 inhibitors US Patent US9676701 Publication Date 6/13/2017
 
Amine oxidase [flavin-containing] B
Name:Amine oxidase [flavin-containing] B
Type:Protein
Mol. Mass.:58768.76
Organism:Homo sapiens (Human)
Description:P27338
Residue:520
BDBM179862
NameBDBM179862
Synonyms:US9676701, 96 N-(4′-((trans)-2-aminocyclopropyl)-4-fluoro-[1,1′-biphenyl]-3-yl)methanesulfonamide hydrochloride
TypeSmall organic molecule
Emp. Form.C16H17FN2O2S
Mol. Mass.320.382
SMILESCS(=O)(=O)Nc1cc(ccc1F)-c1ccc(cc1)[C@H]1C[C@@H]1N