Reaction Details
TargetAromatase
LigandBDBM9953
Substrate/CompetitorBDBM8592
Meas. Tech.Aromatase Assay
pH7.5±n/a
Temperature310.15±n/a K
Ki 7.8±n/a nM
IC50 60±n/a nM
Citation Numazawa, MOshibe, MYamaguchi, STachibana, M Time-dependent inactivation of aromatase by 6-alkylandrosta-1,4-diene-3,17-diones. Effects of length and configuration of 6-alkyl group. J Med Chem39:1033-8 (1996) 
 
Aromatase
Name:Aromatase
Type:Enzyme
Mol. Mass.:57888.92
Organism:Homo sapiens (Human)
Description:P11511
Residue:503
BDBM9953
BDBM8592
NameBDBM9953
Synonyms:(8R)-8-heptyl-2,15-dimethyltetracyclo[8.7.0.0^{2,7}.0^{11,15}]heptadeca-3,6-diene-5,14-dione | 6-Alkyl 1,4-Diene Steroid 4g
TypeSmall organic molecule
Emp. Form.C26H38O2
Mol. Mass.382.5787
SMILESCCCCCCC[C@@H]1CC2C3CCC(=O)C3(C)CCC2C2(C)C=CC(=O)C=C12