Reaction Details
TargetAromatase
LigandBDBM9967
Substrate/CompetitorBDBM8592
Meas. Tech.Aromatase Assay
pH7.5±n/a
Temperature310.15±n/a K
Ki 12±n/a nM
IC50 120±n/a nM
Km33±n/a nM
Citation Numazawa, MKamiyama, TTachibana, MOshibe, M Synthesis and structure-activity relationships of 6-substituted androst-4-ene analogs as aromatase inhibitors. J Med Chem39:2245-52 (1996) 
 
Aromatase
Name:Aromatase
Type:Enzyme
Mol. Mass.:57888.92
Organism:Homo sapiens (Human)
Description:P11511
Residue:503
BDBM9967
BDBM8592
NameBDBM9967
Synonyms:(8S)-8-methoxy-2,15-dimethyltetracyclo[8.7.0.0^{2,7}.0^{11,15}]heptadec-6-en-14-one | 6-Substituted Androst-4-ene Analog 4c
TypeSmall organic molecule
Emp. Form.C20H30O2
Mol. Mass.302.451
SMILESCO[C@H]1CC2C3CCC(=O)C3(C)CCC2C2(C)CCCC=C12