Reaction Details
TargetAromatase
LigandBDBM9981
Substrate/CompetitorBDBM8592
Meas. Tech.Aromatase Assay
Ki 6.8±n/a nM
IC50 60±n/a nM
Citation Numazawa, MKamiyama, TTachibana, MOshibe, M Synthesis and structure-activity relationships of 6-substituted androst-4-ene analogs as aromatase inhibitors. J Med Chem39:2245-52 (1996) 
 
Aromatase
Name:Aromatase
Type:Enzyme
Mol. Mass.:57888.92
Organism:Homo sapiens (Human)
Description:P11511
Residue:503
BDBM9981
BDBM8592
NameBDBM9981
Synonyms:2,15-dimethyltetracyclo[8.7.0.0^{2,7}.0^{11,15}]heptadec-6-en-14-one CHEMBL71715
TypeSmall organic molecule
Emp. Form.C19H28O
Mol. Mass.272.425
SMILESCC12CCC3C(CCC4=CCCCC34C)C1CCC2=O