Reaction Details
TargetAromatase
LigandBDBM9984
Substrate/CompetitorBDBM8592
Meas. Tech.Aromatase Assay
pH7.5±n/a
Temperature310.15±n/a K
Ki 60±n/a nM
IC50 700±n/a nM
Km33±n/a nM
Citation Numazawa, MYamada, KNitta, SSasaki, CKidokoro, K Role of hydrophilic interaction in binding of hydroxylated 3-deoxy C(19) steroids to the active site of aromatase. J Med Chem44:4277-83 (2001) 
 
Aromatase
Name:Aromatase
Type:Enzyme
Mol. Mass.:57888.92
Organism:Homo sapiens (Human)
Description:P11511
Residue:503
BDBM9984
BDBM8592
NameBDBM9984
Synonyms:(2R,6R,15S)-2,15-dimethyl-14-oxotetracyclo[8.7.0.0^{2,7}.0^{11,15}]heptadec-7-en-6-yl acetate 4alpha-Acetoxyandrost-5-en-17-one
TypeSmall organic molecule
Emp. Form.C21H30O3
Mol. Mass.330.4611
SMILESCC(=O)O[C@@H]1CCC[C@]2(C)C3CC[C@@]4(C)C(CCC4=O)C3CC=C12