Reaction Details
TargetAromatase
LigandBDBM9996
Substrate/CompetitorBDBM8592
Meas. Tech.Aromatase Assay
pH7.5±n/a
Temperature310.15±n/a K
Ki 6.8±n/a nM
IC50 60±n/a nM
Km33±n/a nM
Citation Numazawa, MYamada, KNitta, SSasaki, CKidokoro, K Role of hydrophilic interaction in binding of hydroxylated 3-deoxy C(19) steroids to the active site of aromatase. J Med Chem44:4277-83 (2001) 
 
Aromatase
Name:Aromatase
Type:Enzyme
Mol. Mass.:57888.92
Organism:Homo sapiens (Human)
Description:P11511
Residue:503
BDBM9996
BDBM8592
NameBDBM9996
Synonyms:(2R,15S)-2,15-dimethyltetracyclo[8.7.0.0^{2,7}.0^{11,15}]heptadec-6-en-14-one CHEMBL421199
TypeSmall organic molecule
Emp. Form.C19H28O
Mol. Mass.272.425
SMILESC[C@]12CCC3C(CCC4=CCCC[C@]34C)C1CCC2=O