Reaction Details
TargetFatty acid-binding protein, adipocyte
LigandBDBM312342
Substrate/Competitorn/a
Meas. Tech.Time Resolved-Fluorescence Energy Transfer (TR-FRET) Assay
IC50 20.0±n/a nM
Citation Buettelmann, BCeccarelli, SMKuehne, HKuhn, BNeidhart, WObst Sander, URichter, H Bicyclic thiophenylamide compounds US Patent US9604977 Publication Date 3/28/2017
 
Fatty acid-binding protein, adipocyte
Name:Fatty acid-binding protein, adipocyte
Type:Enzyme
Mol. Mass.:14719.23
Organism:Homo sapiens (Human)
Description:P15090
Residue:132
BDBM312342
NameBDBM312342
Synonyms:2-[3-(3-Cyclopropyl-[1,2,4]oxadiazol-5-yl)-6-methyl-4,5,6,7-tetrahydro-benzo[b]thiophen-2-ylcarbamoyl]-cyclopent-1-enecarboxylic acid | US9604977, Example 88
TypeSmall organic molecule
Emp. Form.C21H23N3O4S
Mol. Mass.413.49
SMILESCC1CCc2c(C1)sc(NC(=O)C1=C(CCC1)C(O)=O)c2-c1nc(no1)C1CC1