Reaction Details
TargetFatty acid-binding protein, adipocyte
LigandBDBM312378
Substrate/Competitorn/a
Meas. Tech.Time Resolved-Fluorescence Energy Transfer (TR-FRET) Assay
IC50 20.0±n/a nM
Citation Buettelmann, BCeccarelli, SMKuehne, HKuhn, BNeidhart, WObst Sander, URichter, H Bicyclic thiophenylamide compounds US Patent US9604977 Publication Date 3/28/2017
 
Fatty acid-binding protein, adipocyte
Name:Fatty acid-binding protein, adipocyte
Type:Enzyme
Mol. Mass.:14719.23
Organism:Homo sapiens (Human)
Description:P15090
Residue:132
BDBM312378
NameBDBM312378
Synonyms:2-[3-(3-Cyclopropyl-[1,2,4]oxadiazol-5-yl)-5,6,7,8-tetrahydro-4H-cyclohepta[b]-thiophen-2-ylcarbamoyl]-cyclohex-1-enecarboxylic acid | US9604977, Example 124
TypeSmall organic molecule
Emp. Form.C22H25N3O4S
Mol. Mass.427.517
SMILESOC(=O)C1=C(CCCC1)C(=O)Nc1sc2CCCCCc2c1-c1nc(no1)C1CC1