Reaction Details
TargetFatty acid-binding protein, adipocyte
LigandBDBM312401
Substrate/Competitorn/a
Meas. Tech.Time Resolved-Fluorescence Energy Transfer (TR-FRET) Assay
IC50 10.00±n/a nM
Citation Buettelmann, BCeccarelli, SMKuehne, HKuhn, BNeidhart, WObst Sander, URichter, H Bicyclic thiophenylamide compounds US Patent US9604977 Publication Date 3/28/2017
 
Fatty acid-binding protein, adipocyte
Name:Fatty acid-binding protein, adipocyte
Type:Enzyme
Mol. Mass.:14719.23
Organism:Homo sapiens (Human)
Description:P15090
Residue:132
BDBM312401
NameBDBM312401
Synonyms:2-[6,6-Difluoro-3-(3-trifluoromethyl-[1,2,4]oxadiazol-5-yl)-4,5,6,7-tetrahydro-benzo[b]-thiophen-2-ylcarbamoyl]-cyclopent-1-enecarboxylic acid | US9604977, Example 147
TypeSmall organic molecule
Emp. Form.C18H14F5N3O4S
Mol. Mass.463.378
SMILESOC(=O)C1=C(CCC1)C(=O)Nc1sc2CC(F)(F)CCc2c1-c1nc(no1)C(F)(F)F