Reaction Details
TargetFatty acid-binding protein, adipocyte
LigandBDBM312453
Substrate/Competitorn/a
Meas. Tech.Time Resolved-Fluorescence Energy Transfer (TR-FRET) Assay
IC50 10.00±n/a nM
Citation Buettelmann, BCeccarelli, SMKuehne, HKuhn, BNeidhart, WObst Sander, URichter, H Bicyclic thiophenylamide compounds US Patent US9604977 Publication Date 3/28/2017
 
Fatty acid-binding protein, adipocyte
Name:Fatty acid-binding protein, adipocyte
Type:Enzyme
Mol. Mass.:14719.23
Organism:Homo sapiens (Human)
Description:P15090
Residue:132
BDBM312453
NameBDBM312453
Synonyms:2-[3-(3-Cyclopropyl-[1,2,4]thiadiazol-5-yl)-6,6-difluoro-4,5,6,7-tetrahydro-benzo[b]thiophen-2-ylcarbamoyl]-cyclohex-1-enecarboxylic acid | US9604977, Example 199
TypeSmall organic molecule
Emp. Form.C21H21F2N3O3S2
Mol. Mass.465.537
SMILESOC(=O)C1=C(CCCC1)C(=O)Nc1sc2CC(F)(F)CCc2c1-c1nc(ns1)C1CC1