Reaction Details
TargetFatty acid-binding protein, adipocyte
LigandBDBM312471
Substrate/Competitorn/a
Meas. Tech.Time Resolved-Fluorescence Energy Transfer (TR-FRET) Assay
IC50 9.00±n/a nM
Citation Buettelmann, BCeccarelli, SMKuehne, HKuhn, BNeidhart, WObst Sander, URichter, H Bicyclic thiophenylamide compounds US Patent US9604977 Publication Date 3/28/2017
 
Fatty acid-binding protein, adipocyte
Name:Fatty acid-binding protein, adipocyte
Type:Enzyme
Mol. Mass.:14719.23
Organism:Homo sapiens (Human)
Description:P15090
Residue:132
BDBM312471
NameBDBM312471
Synonyms:2-[5-(3-Cyclopropyl-[1,2,4]oxadiazol-5-yl)-3,4-dihydro-2H-thieno[2,3-b]pyran-6-ylcarbamoyl]-cyclopent-1-enecarboxylic acid | US9604977, Example 217
TypeSmall organic molecule
Emp. Form.C19H19N3O5S
Mol. Mass.401.436
SMILESOC(=O)C1=C(CCC1)C(=O)Nc1sc2OCCCc2c1-c1nc(no1)C1CC1