Reaction Details
TargetTyrosine-protein kinase JAK2
LigandBDBM232601
Substrate/Competitorn/a
Meas. Tech.JAK Enzyme Assay
Ki 0.140±n/a nM
Citation Zak, MERay, NCGoodacre, SCMendonca, RKellar, TCheng, YLi, WYuen, P 5-chloro-2-difluoromethoxyphenyl pyrazolopyrimidine compounds, compositions and methods of use thereof US Patent US9604984 Publication Date 3/28/2017
 
Tyrosine-protein kinase JAK2
Name:Tyrosine-protein kinase JAK2
Type:Protein
Mol. Mass.:130684.68
Organism:Homo sapiens (Human)
Description:O60674
Residue:1132
BDBM232601
NameBDBM232601
Synonyms:US9346815, 147 | US9604984, Example 147
TypeSmall organic molecule
Emp. Form.C30H34ClF2N9O4
Mol. Mass.658.099
SMILESNc1nn2cccnc2c1C(=O)Nc1cn(nc1-c1cc(Cl)ccc1OC(F)F)C1CCN(CCCC(=O)N2CCOCC2)CC1