Reaction Details
TargetTyrosine-protein kinase JAK2
LigandBDBM232603
Substrate/Competitorn/a
Meas. Tech.JAK Enzyme Assay
Ki 0.200±n/a nM
Citation Zak, MERay, NCGoodacre, SCMendonca, RKellar, TCheng, YLi, WYuen, P 5-chloro-2-difluoromethoxyphenyl pyrazolopyrimidine compounds, compositions and methods of use thereof US Patent US9604984 Publication Date 3/28/2017
 
Tyrosine-protein kinase JAK2
Name:Tyrosine-protein kinase JAK2
Type:Protein
Mol. Mass.:130684.68
Organism:Homo sapiens (Human)
Description:O60674
Residue:1132
BDBM232603
NameBDBM232603
Synonyms:US9346815, 149 | US9604984, Example 149
TypeSmall organic molecule
Emp. Form.C27H30ClF2N9O3
Mol. Mass.602.035
SMILESCNC(=O)CCCN1CCC(CC1)n1cc(NC(=O)c2c(N)nn3cccnc23)c(n1)-c1cc(Cl)ccc1OC(F)F