Reaction Details
TargetTyrosine-protein kinase JAK1
LigandBDBM232618
Substrate/Competitorn/a
Meas. Tech.JAK Enzyme Assay
Ki 0.440±n/a nM
Citation Zak, MERay, NCGoodacre, SCMendonca, RKellar, TCheng, YLi, WYuen, P 5-chloro-2-difluoromethoxyphenyl pyrazolopyrimidine compounds, compositions and methods of use thereof US Patent US9604984 Publication Date 3/28/2017
 
Tyrosine-protein kinase JAK1
Name:Tyrosine-protein kinase JAK1
Type:Protein
Mol. Mass.:133293.73
Organism:Homo sapiens (Human)
Description:P23458
Residue:1154
BDBM232618
NameBDBM232618
Synonyms:US9346815, 164 | US9604984, Example 164
TypeSmall organic molecule
Emp. Form.C29H33ClF2N10O3
Mol. Mass.643.087
SMILESCN1CCN(CCCN2CCC(CC2)n2cc(NC(=O)c3c(N)nn4cccnc34)c(n2)-c2cc(Cl)ccc2OC(F)F)C1=O