Reaction Details
TargetTyrosine-protein kinase JAK2
LigandBDBM232720
Substrate/Competitorn/a
Meas. Tech.JAK Enzyme Assay
Ki 0.100±n/a nM
Citation Zak, MERay, NCGoodacre, SCMendonca, RKellar, TCheng, YLi, WYuen, P 5-chloro-2-difluoromethoxyphenyl pyrazolopyrimidine compounds, compositions and methods of use thereof US Patent US9604984 Publication Date 3/28/2017
 
Tyrosine-protein kinase JAK2
Name:Tyrosine-protein kinase JAK2
Type:Protein
Mol. Mass.:130684.68
Organism:Homo sapiens (Human)
Description:O60674
Residue:1132
BDBM232720
NameBDBM232720
Synonyms:US9346815, 266 | US9604984, Example 266
TypeSmall organic molecule
Emp. Form.C25H25ClF2N8O4
Mol. Mass.574.967
SMILESNc1nn2cccnc2c1C(=O)Nc1cn(CC(=O)N2CCC(CO)CC2)nc1-c1cc(Cl)ccc1OC(F)F