Reaction Details
TargetTyrosine-protein kinase JAK2
LigandBDBM232738
Substrate/Competitorn/a
Meas. Tech.JAK Enzyme Assay
Ki 0.370±n/a nM
Citation Zak, MERay, NCGoodacre, SCMendonca, RKellar, TCheng, YLi, WYuen, P 5-chloro-2-difluoromethoxyphenyl pyrazolopyrimidine compounds, compositions and methods of use thereof US Patent US9604984 Publication Date 3/28/2017
 
Tyrosine-protein kinase JAK2
Name:Tyrosine-protein kinase JAK2
Type:Protein
Mol. Mass.:130684.68
Organism:Homo sapiens (Human)
Description:O60674
Residue:1132
BDBM232738
NameBDBM232738
Synonyms:US9346815, 284 | US9604984, Example 284
TypeSmall organic molecule
Emp. Form.C24H20ClF2N7O3
Mol. Mass.527.911
SMILESFC(F)Oc1ccc(Cl)cc1-c1nn(CC(=O)N2CCC=CC2)cc1NC(=O)c1cnn2cccnc12