Reaction Details
TargetTyrosine-protein kinase JAK1
LigandBDBM232909
Substrate/Competitorn/a
Meas. Tech.JAK Enzyme Assay
Ki 0.300±n/a nM
Citation Zak, MERay, NCGoodacre, SCMendonca, RKellar, TCheng, YLi, WYuen, P 5-chloro-2-difluoromethoxyphenyl pyrazolopyrimidine compounds, compositions and methods of use thereof US Patent US9604984 Publication Date 3/28/2017
 
Tyrosine-protein kinase JAK1
Name:Tyrosine-protein kinase JAK1
Type:Protein
Mol. Mass.:133293.73
Organism:Homo sapiens (Human)
Description:P23458
Residue:1154
BDBM232909
NameBDBM232909
Synonyms:US9346815, 455 | US9604984, Example 455
TypeSmall organic molecule
Emp. Form.C29H29ClF2N10O3
Mol. Mass.639.056
SMILESFC(F)Oc1ccc(Cl)cc1-c1nn(Cc2cn(nn2)C2CCN(CC2)C2CCOC2)cc1NC(=O)c1cnn2cccnc12