Reaction Details
TargetInhibitor of nuclear factor kappa-B kinase subunit beta
LigandBDBM312776
Substrate/Competitorn/a
Meas. Tech.NIK Enzyme Inhibition Assay
Ki 0.050±n/a nM
Citation Blaquiere, NCastanedo, GFeng, JAHu, BStaben, SYuen, PWu, GBurch, J Alkynyl alcohols and methods of use US Patent US9605005 Publication Date 3/28/2017
 
Inhibitor of nuclear factor kappa-B kinase subunit beta
Name:Inhibitor of nuclear factor kappa-B kinase subunit beta
Type:Serine/threonine-protein kinase
Mol. Mass.:86554.39
Organism:Homo sapiens (Human)
Description:GST-tagged IKK-2 was expressed in High Five cells and purified.
Residue:756
BDBM312776
NameBDBM312776
Synonyms:1-[4-[2-[(3R)-3-hydroxy-1- methyl-2-oxo-pyrrolidin-3- yl]ethynyl]-2-pyridyl]-5-meth- oxy-indazole-3-carboxamide | US9605005, Example 65
TypeSmall organic molecule
Emp. Form.C21H19N5O4
Mol. Mass.405.4067
SMILESCOc1ccc2n(nc(C(N)=O)c2c1)-c1cc(ccn1)C#C[C@]1(O)CCN(C)C1=O