Reaction Details
TargetInhibitor of nuclear factor kappa-B kinase subunit beta
LigandBDBM312903
Substrate/Competitorn/a
Meas. Tech.NIK Enzyme Inhibition Assay
Ki 0.100±n/a nM
Citation Blaquiere, NCastanedo, GFeng, JAHu, BStaben, SYuen, PWu, GBurch, J Alkynyl alcohols and methods of use US Patent US9605005 Publication Date 3/28/2017
 
Inhibitor of nuclear factor kappa-B kinase subunit beta
Name:Inhibitor of nuclear factor kappa-B kinase subunit beta
Type:Serine/threonine-protein kinase
Mol. Mass.:86554.39
Organism:Homo sapiens (Human)
Description:GST-tagged IKK-2 was expressed in High Five cells and purified.
Residue:756
BDBM312903
NameBDBM312903
Synonyms:(5S)-1-[3-[2-[(3R)-3-hydroxy- 1-methyl-2-oxo-pyrrolidin- 3-yl]ethynyl]phenyl]-5- methyl-5,6-dihydro-4H-cyclo- penta[c]pyrazole-3-carbox- amide | US9605005, Example 193
TypeSmall organic molecule
Emp. Form.C21H22N4O3
Mol. Mass.378.4244
SMILESC[C@H]1Cc2c(C1)n(nc2C(N)=O)-c1cccc(c1)C#C[C@]1(O)CCN(C)C1=O