Reaction Details
TargetHigh affinity nerve growth factor receptor
LigandBDBM164943
Substrate/Competitorn/a
Meas. Tech.In Vitro TrkA Activity
IC50 0.200±n/a nM
Citation Kane, Jr., JLMatthews, GMetz, MKothe, MLiu, JScholte, A Tropomyosin-related kinase (Trk) inhibitors US Patent US10166239 Publication Date 1/1/2019
 
High affinity nerve growth factor receptor
Name:High affinity nerve growth factor receptor
Type:n/a
Mol. Mass.:87498.18
Organism:Homo sapiens (Human)
Description:P04629
Residue:796
BDBM164943
NameBDBM164943
Synonyms:US10166239, Ex. 3-40-3 US9067914, Ex. 3-40-3
TypeSmall organic molecule
Emp. Form.C27H29N7O2
Mol. Mass.483.5649
SMILESCOc1cc(Cn2c(N)nc3cc(cnc23)-c2cnn(C)c2)ccc1OCc1ccc(nc1)C(C)C