Reaction Details
TargetBDNF/NT-3 growth factors receptor
LigandBDBM164956
Substrate/Competitorn/a
Meas. Tech.In Vitro TrkB Activity
IC50 0.600±n/a nM
Citation Kane, Jr., JLMatthews, GMetz, MKothe, MLiu, JScholte, A Tropomyosin-related kinase (Trk) inhibitors US Patent US10166239 Publication Date 1/1/2019
 
BDNF/NT-3 growth factors receptor
Name:BDNF/NT-3 growth factors receptor
Type:Enzyme
Mol. Mass.:91996.87
Organism:Homo sapiens (Human)
Description:Q16620
Residue:822
BDBM164956
NameBDBM164956
Synonyms:US10166239, Ex. 3-49-6a US9067914, Ex. 3-49-6a
TypeSmall organic molecule
Emp. Form.C27H25F3N6O2
Mol. Mass.522.5216
SMILESCOc1cc(ccc1OCc1ccc(cc1)C(F)(F)F)[C@H](C)n1c(N)nc2cc(cnc12)-c1cnn(C)c1