Reaction Details
TargetSphingosine-1-phosphate lyase 1
LigandBDBM313204
Substrate/Competitorn/a
Meas. Tech.S1P1 Binding Assay
IC50<10±n/a nM
Citation Dyckman, AJDhar, TGXiao, HGilmore, JLYang, MGXiao, ZMarcoux, D Substituted bicyclic compounds US Patent US10166249 Publication Date 1/1/2019
 
Sphingosine-1-phosphate lyase 1
Name:Sphingosine-1-phosphate lyase 1
Type:PROTEIN
Mol. Mass.:63546.76
Organism:Homo sapiens (Human)
Description:ChEMBL_108363
Residue:568
BDBM313204
NameBDBM313204
Synonyms:US10166249, Example 433 | US10166249, Example 434
TypeSmall organic molecule
Emp. Form.C21H34NO5P
Mol. Mass.411.4721
SMILESCCCCCOC1CCc2cc(ccc2C1)[C@@H]1CC[C@](N)(COP(O)(O)=O)C1