Reaction Details
TargetSphingosine-1-phosphate lyase 1
LigandBDBM65068
Substrate/Competitorn/a
Meas. Tech.hS1P1 ERK Phosphorylation (S1P1 pERK)
EC50<10±n/a nM
Citation Dyckman, AJDhar, TGXiao, HGilmore, JLYang, MGXiao, ZMarcoux, D Substituted bicyclic compounds US Patent US10166249 Publication Date 1/1/2019
 
Sphingosine-1-phosphate lyase 1
Name:Sphingosine-1-phosphate lyase 1
Type:PROTEIN
Mol. Mass.:63546.76
Organism:Homo sapiens (Human)
Description:ChEMBL_108363
Residue:568
BDBM65068
NameBDBM65068
Synonyms:US10166249, Example 437 US9522888, 440
Typen/a
Emp. Form.C22H34NO5P
Mol. Mass.423.4828
SMILESCCC\C=C/CO[C@H]1CCc2cc(ccc2C1)[C@H]1CC[C@](N)(COP(O)(O)=O)C1